Reaction Details
TargetCholinesterase
LigandBDBM50322766
Substrate/Competitorn/a
Meas. Tech.ChEMBL_642382 (CHEMBL1177575)
IC50 5±n/a nM
Citation Fernández-Bachiller, MIPérez, CGonzález-Muñoz, GCConde, SLópez, MGVillarroya, MGarcía, AGRodríguez-Franco, MI Novel tacrine-8-hydroxyquinoline hybrids as multifunctional agents for the treatment of Alzheimer's disease, with neuroprotective, cholinergic, antioxidant, and copper-complexing properties. J Med Chem53:4927-37 (2010) 
 
Cholinesterase
Name:Cholinesterase
Type:Enzyme
Mol. Mass.:65643.35
Organism:Equus caballus (Horse)
Description:P81908
Residue:574
BDBM50322766
NameBDBM50322766
Synonyms:7-{[9-(1,2,3,4-Tetrahydroacridin-9-ylamino)nonylamino]methyl}-quinolin-8-ol Dihydrochloride | CHEMBL1173662
TypeSmall organic molecule
Emp. Form.C32H40N4O
Mol. Mass.496.6862
SMILESOc1c(CNCCCCCCCCCNc2c3CCCCc3nc3ccccc23)ccc2cccnc12