Reaction Details
TargetCholinesterase
LigandBDBM50322777
Substrate/Competitorn/a
Meas. Tech.ChEMBL_642382 (CHEMBL1177575)
IC50 7±n/a nM
Citation Fernández-Bachiller, MIPérez, CGonzález-Muñoz, GCConde, SLópez, MGVillarroya, MGarcía, AGRodríguez-Franco, MI Novel tacrine-8-hydroxyquinoline hybrids as multifunctional agents for the treatment of Alzheimer's disease, with neuroprotective, cholinergic, antioxidant, and copper-complexing properties. J Med Chem53:4927-37 (2010) 
 
Cholinesterase
Name:Cholinesterase
Type:Enzyme
Mol. Mass.:65643.35
Organism:Equus caballus (Horse)
Description:P81908
Residue:574
BDBM50322777
NameBDBM50322777
Synonyms:2-Methyl-7-{[10-(1,2,3,4-tetrahydroacridin-9-ylamino)decylamino]methyl}quinolin-8-ol Dihydrochloride | CHEMBL1173521
TypeSmall organic molecule
Emp. Form.C34H44N4O
Mol. Mass.524.7394
SMILESCc1ccc2ccc(CNCCCCCCCCCCNc3c4CCCCc4nc4ccccc34)c(O)c2n1