Reaction Details
TargetNeuropeptide S receptor
LigandBDBM50322842
Substrate/Competitorn/a
Meas. Tech.ChEMBL_644490 (CHEMBL1211328)
IC50 18±n/a nM
Citation Melamed, JYZartman, AEKett, NRGotter, ALUebele, VNReiss, DRCondra, CLFandozzi, CLubbers, LSRowe, BAMcGaughey, GBHenault, MStocco, RRenger, JJHartman, GDBilodeau, MTTrotter, BW Synthesis and evaluation of a new series of Neuropeptide S receptor antagonists. Bioorg Med Chem Lett20:4700-3 (2010) 
 
Neuropeptide S receptor
Name:Neuropeptide S receptor
Type:PROTEIN
Mol. Mass.:42692.30
Organism:Homo sapiens (Human)
Description:ChEMBL_1276607
Residue:371
BDBM50322842
NameBDBM50322842
Synonyms:CHEMBL1210177 | N-((1-methyl-2-oxo-1,2-dihydroquinolin-3-yl)methyl)-N-((1-(4-methylpiperazin-1-yl)cyclohexyl)methyl)cyclohexanecarboxamide
TypeSmall organic molecule
Emp. Form.C30H44N4O2
Mol. Mass.492.696
SMILESCN1CCN(CC1)C1(CN(Cc2cc3ccccc3n(C)c2=O)C(=O)C2CCCCC2)CCCCC1