Reaction Details
TargetSomatostatin receptor type 5
LigandBDBM50322977
Substrate/Competitorn/a
Meas. Tech.ChEMBL_643471 (CHEMBL1212335)
Ki 18±n/a nM
Citation Alker, ABinggeli, AChrist, ADGreen, LMaerki, HPMartin, REMohr, P Piperidinyl-nicotinamides as potent and selective somatostatin receptor subtype 5 antagonists. Bioorg Med Chem Lett20:4521-5 (2010) 
 
Somatostatin receptor type 5
Name:Somatostatin receptor type 5
Type:Enzyme
Mol. Mass.:39218.02
Organism:Homo sapiens (Human)
Description:P35346
Residue:364
BDBM50322977
NameBDBM50322977
Synonyms:CHEMBL1210268 | N-(1-(3,5-diethoxy-4-fluorobenzyl)piperidin-4-yl)-6-(methylamino)nicotinamide
TypeSmall organic molecule
Emp. Form.C23H31FN4O3
Mol. Mass.430.5156
SMILESCCOc1cc(CN2CCC(CC2)NC(=O)c2ccc(NC)nc2)cc(OCC)c1F