Reaction Details
TargetSomatostatin receptor type 5
LigandBDBM50322984
Substrate/Competitorn/a
Meas. Tech.ChEMBL_643471 (CHEMBL1212335)
Ki 6.3±n/a nM
Citation Alker, ABinggeli, AChrist, ADGreen, LMaerki, HPMartin, REMohr, P Piperidinyl-nicotinamides as potent and selective somatostatin receptor subtype 5 antagonists. Bioorg Med Chem Lett20:4521-5 (2010) 
 
Somatostatin receptor type 5
Name:Somatostatin receptor type 5
Type:Enzyme
Mol. Mass.:39218.02
Organism:Homo sapiens (Human)
Description:P35346
Residue:364
BDBM50322984
NameBDBM50322984
Synonyms:CHEMBL1210143 | N-(1-(3,5-diethoxy-4-fluorobenzyl)piperidin-4-yl)-6-(isopropylamino)nicotinamide
TypeSmall organic molecule
Emp. Form.C25H35FN4O3
Mol. Mass.458.5688
SMILESCCOc1cc(CN2CCC(CC2)NC(=O)c2ccc(NC(C)C)nc2)cc(OCC)c1F