Reaction Details
TargetMetabotropic glutamate receptor 5
LigandBDBM50258619
Substrate/Competitorn/a
Meas. Tech.ChEMBL_643903 (CHEMBL1211802)
Ki 157±n/a nM
Citation Felts, ASLindsley, SRLamb, JPRodriguez, ALMenon, UNJadhav, SJones, CKConn, PJLindsley, CWEmmitte, KA 3-Cyano-5-fluoro-N-arylbenzamides as negative allosteric modulators of mGlu(5): Identification of easily prepared tool compounds with CNS exposure in rats. Bioorg Med Chem Lett20:4390-4 (2010) 
 
Metabotropic glutamate receptor 5
Name:Metabotropic glutamate receptor 5
Type:Enzyme
Mol. Mass.:131900.14
Organism:Rattus norvegicus (Rat)
Description:P31424
Residue:1203
BDBM50258619
NameBDBM50258619
Synonyms:3-Cyano-5-fluoro-N-(6-methylpyridin-2-yl)-benzamide CHEMBL464372
TypeSmall organic molecule
Emp. Form.C14H10FN3O
Mol. Mass.255.2471
SMILESCc1cccc(NC(=O)c2cc(F)cc(c2)C#N)n1