Reaction Details
TargetDynamin-1
LigandBDBM50323460
Substrate/Competitorn/a
Meas. Tech.ChEMBL_644134 (CHEMBL1212033)
IC50 10800±n/a nM
Citation Lee, SJung, KYPark, JCho, JHKim, YCChang, S Synthesis of potent chemical inhibitors of dynamin GTPase. Bioorg Med Chem Lett20:4858-64 (2010) 
 
Dynamin-1
Name:Dynamin-1
Type:PROTEIN
Mol. Mass.:97411.67
Organism:Homo sapiens (Human)
Description:ChEMBL_1458576
Residue:864
BDBM50323460
NameBDBM50323460
Synonyms:CHEMBL1209885 | N'-(3,4-dihydroxybenzylidene)-3-hydroxy-2-naphthohydrazide
TypeSmall organic molecule
Emp. Form.C18H14N2O4
Mol. Mass.322.3148
SMILESOc1ccc(\C=N\NC(=O)c2cc3ccccc3cc2O)cc1O