Reaction Details
TargetCannabinoid receptor 1
LigandBDBM50323613
Substrate/Competitorn/a
Meas. Tech.ChEMBL_645041 (CHEMBL1211490)
IC50 2000±n/a nM
Citation Kopka, IELin, LSJewell, JPLanza, TJFong, TMShen, CPLao, ZJHa, SCastonguay, LGVan der Ploeg, LGoulet, MTHagmann, WK Synthesis and cannabinoid-1 receptor binding affinity of conformationally constrained analogs of taranabant. Bioorg Med Chem Lett20:4757-61 (2010) 
 
Cannabinoid receptor 1
Name:Cannabinoid receptor 1
Type:G Protein-Coupled Receptor (GPCR)
Mol. Mass.:52868.96
Organism:Homo sapiens (Human)
Description:P21554
Residue:472
BDBM50323613
NameBDBM50323613
Synonyms:(+/-)-1-(3-(4-chlorobenzyl)-3-phenylpiperidin-1-yl)-2-methyl-2-(5-(trifluoromethyl)pyridin-2-yloxy)propan-1-one | CHEMBL1209749
TypeSmall organic molecule
Emp. Form.C28H28ClF3N2O2
Mol. Mass.516.982
SMILESCC(C)(Oc1ccc(cn1)C(F)(F)F)C(=O)N1CCCC(Cc2ccc(Cl)cc2)(C1)c1ccccc1