Reaction Details
TargetMuscarinic acetylcholine receptor M5
LigandBDBM50403547
Substrate/Competitorn/a
Meas. Tech.ChEMBL_648994 (CHEMBL1218692)
Ki 0.86±n/a nM
Citation Shirey, JKXiang, ZOrton, DBrady, AEJohnson, KAWilliams, RAyala, JERodriguez, ALWess, JWeaver, DNiswender, CMConn, PJ An allosteric potentiator of M4 mAChR modulates hippocampal synaptic transmission. Nat Chem Biol4:42-50 (2007) 
 
Muscarinic acetylcholine receptor M5
Name:Muscarinic acetylcholine receptor M5
Type:Enzyme Catalytic Domain
Mol. Mass.:60161.80
Organism:RAT
Description:Cholinergic, muscarinic M5 CHRM5 RAT::P08911
Residue:531
BDBM50403547
NameBDBM50403547
Synonyms:ATROPEN | ATROPINE
TypeSmall organic molecule
Emp. Form.C17H23NO3
Mol. Mass.289.3694
SMILESCN1[C@H]2CC[C@@H]1C[C@@H](C2)OC(=O)C(CO)c1ccccc1