Reaction Details
TargetGlutamate receptor 2
LigandBDBM86751
Substrate/Competitorn/a
Meas. Tech.ChEMBL_646894 (CHEMBL1217035)
Ki 3200±n/a nM
Citation Mattes, HCarcache, DKalkman, HOKoller, M alpha-Amino-3-hydroxy-5-methyl-4-isoxazolepropionic acid (AMPA) antagonists: from bench to bedside. J Med Chem53:5367-82 (2010) 
 
Glutamate receptor 2
Name:Glutamate receptor 2
Type:Enzyme Catalytic Domain
Mol. Mass.:98825.96
Organism:Homo sapiens (Human)
Description:Glutamate AMPA 2 GRIA2 HUMAN::P42262
Residue:883
BDBM86751
NameBDBM86751
Synonyms:CHEMBL14935 LY-293558
TypeSmall organic molecule
Emp. Form.C13H21N5O2
Mol. Mass.279.3381
SMILESOC(=O)[C@@H]1C[C@H]2C[C@@H](CCc3nnn[nH]3)CC[C@H]2CN1