Reaction Details
TargetTransient receptor potential cation channel subfamily V member 1
LigandBDBM50323839
Substrate/Competitorn/a
Meas. Tech.ChEMBL_647525 (CHEMBL1217572)
IC50 1.3±n/a nM
Citation Hodgetts, KJBlum, CACaldwell, TBakthavatchalam, RZheng, XCapitosti, SKrause, JECortright, DCrandall, MMurphy, BABoyce, SBrian Jones, AChenard, BL Pyrido[2,3-b]pyrazines, discovery of TRPV1 antagonists with reduced potential for the formation of reactive metabolites. Bioorg Med Chem Lett20:4359-63 (2010) 
 
Transient receptor potential cation channel subfamily V member 1
Name:Transient receptor potential cation channel subfamily V member 1
Type:Transient Receptor
Mol. Mass.:94956.12
Organism:Rattus norvegicus (rat)
Description:O35433
Residue:838
BDBM50323839
NameBDBM50323839
Synonyms:5-(trifluoromethyl)-6-(8-(5-(trifluoromethyl)pyridin-2-ylamino)pyrido[2,3-b]pyrazin-3-yl)nicotinamide | CHEMBL1214402
TypeSmall organic molecule
Emp. Form.C20H11F6N7O
Mol. Mass.479.3381
SMILESNC(=O)c1cnc(-c2cnc3c(Nc4ccc(cn4)C(F)(F)F)ccnc3n2)c(c1)C(F)(F)F