Reaction Details
TargetMu-type opioid receptor
LigandBDBM50304493
Substrate/Competitorn/a
Meas. Tech.ChEMBL_647570 (CHEMBL1217617)
Ki 0.500000±n/a nM
Citation Yamamoto, TNair, PJacobsen, NEKulkarni, VDavis, PMa, SWNavratilova, EYamamura, HIVanderah, TWPorreca, FLai, JHruby, VJ Biological and conformational evaluation of bifunctional compounds for opioid receptor agonists and neurokinin 1 receptor antagonists possessing two penicillamines. J Med Chem53:5491-501 (2010) 
 
Mu-type opioid receptor
Name:Mu-type opioid receptor
Type:G Protein-Coupled Receptor (GPCR)
Mol. Mass.:44503.11
Organism:Rattus norvegicus (rat)
Description:Competition binding assays were carried out using membrane preparations from transfected HN9.10 cells that constitutively expressed the mu opioid receptor.
Residue:398
BDBM50304493
NameBDBM50304493
Synonyms:CHEMBL595972 Tyr-DAla-Gly-Phe-Met-NH2
TypeSmall organic molecule
Emp. Form.C28H38N6O6S
Mol. Mass.586.703
SMILESCSCC[C@H](NC(=O)[C@H](Cc1ccccc1)NC(=O)CNC(=O)[C@@H](C)NC(=O)[C@@H](N)Cc1ccc(O)cc1)C(N)=O