Reaction Details
TargetHistone acetyltransferase KAT2B
LigandBDBM50324038
Substrate/Competitorn/a
Meas. Tech.ChEMBL_649478 (CHEMBL1219176)
IC50 662000±n/a nM
Citation Ghizzoni, MBoltjes, AGraaf, CHaisma, HJDekker, FJ Improved inhibition of the histone acetyltransferase PCAF by an anacardic acid derivative. Bioorg Med Chem18:5826-34 (2010) 
 
Histone acetyltransferase KAT2B
Name:Histone acetyltransferase KAT2B
Type:PROTEIN
Mol. Mass.:93045.76
Organism:Homo sapiens (Human)
Description:ChEMBL_1502838
Residue:832
BDBM50324038
NameBDBM50324038
Synonyms:(Z)-2-Hydroxy-6-(4-(pentyloxy)styryl)benzoic acid | CHEMBL1214674
TypeSmall organic molecule
Emp. Form.C20H22O4
Mol. Mass.326.3863
SMILESCCCCCOc1ccc(\C=C/c2cccc(O)c2C(O)=O)cc1