Reaction Details
TargetAcetylcholinesterase
LigandBDBM50324070
Substrate/Competitorn/a
Meas. Tech.ChEMBL_649485 (CHEMBL1219183)
IC50 10000±n/a nM
Citation Samadi, AMarco-Contelles, JSoriano, EAlvarez-Pérez, MChioua, MRomero, AGonzález-Lafuente, LGandía, LRoda, JMLópez, MGVillarroya, MGarcía, AGRíos, Cde L Multipotent drugs with cholinergic and neuroprotective properties for the treatment of Alzheimer and neuronal vascular diseases. I. Synthesis, biological assessment, and molecular modeling of simple and readily available 2-aminopyridine-, and 2-chloropyridine-3,5-dicarbonitriles. Bioorg Med Chem18:5861-72 (2010) 
 
Acetylcholinesterase
Name:Acetylcholinesterase
Type:Enzyme
Mol. Mass.:71812.79
Organism:Electrophorus electricus (Electric eel)
Description:n/a
Residue:633
BDBM50324070
NameBDBM50324070
Synonyms:2-Chloro-6-(dimethylamino)-4-phenylpyridine-3,5-dicarbonitrile | CHEMBL1215105
TypeSmall organic molecule
Emp. Form.C15H11ClN4
Mol. Mass.282.728
SMILESCN(C)c1nc(Cl)c(C#N)c(-c2ccccc2)c1C#N