Reaction Details
TargetCarboxylic ester hydrolase
LigandBDBM50324058
Substrate/Competitorn/a
Meas. Tech.ChEMBL_649486 (CHEMBL1219184)
IC50>100000±n/a nM
Citation Samadi, AMarco-Contelles, JSoriano, EAlvarez-Pérez, MChioua, MRomero, AGonzález-Lafuente, LGandía, LRoda, JMLópez, MGVillarroya, MGarcía, AGRíos, Cde L Multipotent drugs with cholinergic and neuroprotective properties for the treatment of Alzheimer and neuronal vascular diseases. I. Synthesis, biological assessment, and molecular modeling of simple and readily available 2-aminopyridine-, and 2-chloropyridine-3,5-dicarbonitriles. Bioorg Med Chem18:5861-72 (2010) 
 
Carboxylic ester hydrolase
Name:Carboxylic ester hydrolase
Type:Protein
Mol. Mass.:68842.83
Organism:Equus caballus (Horse)
Description:Q9N1N9
Residue:602
BDBM50324058
NameBDBM50324058
Synonyms:2-Amino-6-(piperidin-1'-yl)-4-phenylpyridine-3,5-dicarbonitrile | CHEMBL1215030
TypeSmall organic molecule
Emp. Form.C18H17N5
Mol. Mass.303.3611
SMILESNc1nc(N2CCCCC2)c(C#N)c(-c2ccccc2)c1C#N