Reaction Details
TargetCarboxylic ester hydrolase
LigandBDBM74685
Substrate/Competitorn/a
Meas. Tech.ChEMBL_649486 (CHEMBL1219184)
IC50>100000±n/a nM
Citation Samadi, AMarco-Contelles, JSoriano, EAlvarez-Pérez, MChioua, MRomero, AGonzález-Lafuente, LGandía, LRoda, JMLópez, MGVillarroya, MGarcía, AGRíos, Cde L Multipotent drugs with cholinergic and neuroprotective properties for the treatment of Alzheimer and neuronal vascular diseases. I. Synthesis, biological assessment, and molecular modeling of simple and readily available 2-aminopyridine-, and 2-chloropyridine-3,5-dicarbonitriles. Bioorg Med Chem18:5861-72 (2010) 
 
Carboxylic ester hydrolase
Name:Carboxylic ester hydrolase
Type:Protein
Mol. Mass.:68842.83
Organism:Equus caballus (Horse)
Description:Q9N1N9
Residue:602
BDBM74685
NameBDBM74685
Synonyms:2-amino-4-phenyl-6-sulfanylidene-1H-pyridine-3,5-dicarbonitrile 2-azanyl-4-phenyl-6-sulfanylidene-1H-pyridine-3,5-dicarbonitrile MLS000105852 cid_780902
TypeSmall organic molecule
Emp. Form.C13H8N4S
Mol. Mass.252.294
SMILESNc1[nH]c(=S)c(C#N)c(-c2ccccc2)c1C#N