Reaction Details
TargetAcetylcholinesterase
LigandBDBM50324068
Substrate/Competitorn/a
Meas. Tech.ChEMBL_649487 (CHEMBL1219185)
Ki 17200±n/a nM
Citation Samadi, AMarco-Contelles, JSoriano, EAlvarez-Pérez, MChioua, MRomero, AGonzález-Lafuente, LGandía, LRoda, JMLópez, MGVillarroya, MGarcía, AGRíos, Cde L Multipotent drugs with cholinergic and neuroprotective properties for the treatment of Alzheimer and neuronal vascular diseases. I. Synthesis, biological assessment, and molecular modeling of simple and readily available 2-aminopyridine-, and 2-chloropyridine-3,5-dicarbonitriles. Bioorg Med Chem18:5861-72 (2010) 
 
Acetylcholinesterase
Name:Acetylcholinesterase
Type:Enzyme
Mol. Mass.:71812.79
Organism:Electrophorus electricus (Electric eel)
Description:n/a
Residue:633
BDBM50324068
NameBDBM50324068
Synonyms:2-Chloro-6-(piperidin-1-yl)pyridine-3,5-dicarbonitrile | CHEMBL1215103
TypeSmall organic molecule
Emp. Form.C12H11ClN4
Mol. Mass.246.696
SMILESClc1nc(N2CCCCC2)c(cc1C#N)C#N