Reaction Details
TargetHistone deacetylase 6
LigandBDBM50324111
Substrate/Competitorn/a
Meas. Tech.ChEMBL_649842 (CHEMBL1219540)
IC50 728.7±n/a nM
Citation Mwakwari, SCGuerrant, WPatil, VKhan, SITekwani, BLGurard-Levin, ZAMrksich, MOyelere, AK Non-peptide macrocyclic histone deacetylase inhibitors derived from tricyclic ketolide skeleton. J Med Chem53:6100-11 (2010) 
 
Histone deacetylase 6
Name:Histone deacetylase 6
Type:Chromatin regulator; hydrolase; repressor
Mol. Mass.:131381.51
Organism:Homo sapiens (Human)
Description:Q9UBN7
Residue:1215
BDBM50324111
NameBDBM50324111
Synonyms:CHEMBL1214760
TypeSmall organic molecule
Emp. Form.C48H73N7O11
Mol. Mass.924.1335
SMILESCC[C@H]1OC(=O)[C@H](C)C(=O)[C@H](C)[C@@H](O[C@@H]2O[C@H](C)C[C@@H]([C@H]2O)N(C)Cc2ccc(cc2)-c2cn(CCCCCCC(=O)NO)nn2)[C@@](C)(C[C@@H](C)C2=NCCN3[C@H]([C@H]2C)[C@]1(C)OC3=O)OC