Reaction Details
TargetDipeptidyl peptidase 8
LigandBDBM50324495
Substrate/Competitorn/a
Meas. Tech.ChEMBL_649273 (CHEMBL1218971)
Ki 2.3±n/a nM
Citation Meng, WBrigance, RPChao, HJFura, AHarrity, TMarcinkeviciene, JO'Connor, SPTamura, JKXie, DZhang, YKlei, HEKish, KWeigelt, CATurdi, HWang, AZahler, RKirby, MSHamann, LG Discovery of 6-(aminomethyl)-5-(2,4-dichlorophenyl)-7-methylimidazo[1,2-a]pyrimidine-2-carboxamides as potent, selective dipeptidyl peptidase-4 (DPP4) inhibitors. J Med Chem53:5620-8 (2010) 
 
Dipeptidyl peptidase 8
Name:Dipeptidyl peptidase 8
Type:Enzyme
Mol. Mass.:103342.62
Organism:Homo sapiens (Human)
Description:Q6V1X1
Residue:898
BDBM50324495
NameBDBM50324495
Synonyms:6-(aminomethyl)-5-(2,4-dichlorophenyl)-7-methyl-N-(4-methylthiazol-2-yl)imidazo[1,2-a]pyrimidine-2-carboxamide | CHEMBL1215090
TypeSmall organic molecule
Emp. Form.C19H16Cl2N6OS
Mol. Mass.447.341
SMILESCc1csc(NC(=O)c2cn3c(c(CN)c(C)nc3n2)-c2ccc(Cl)cc2Cl)n1