Reaction Details
TargetDipeptidyl peptidase 8
LigandBDBM50324496
Substrate/Competitorn/a
Meas. Tech.ChEMBL_649273 (CHEMBL1218971)
Ki 2.9±n/a nM
Citation Meng, WBrigance, RPChao, HJFura, AHarrity, TMarcinkeviciene, JO'Connor, SPTamura, JKXie, DZhang, YKlei, HEKish, KWeigelt, CATurdi, HWang, AZahler, RKirby, MSHamann, LG Discovery of 6-(aminomethyl)-5-(2,4-dichlorophenyl)-7-methylimidazo[1,2-a]pyrimidine-2-carboxamides as potent, selective dipeptidyl peptidase-4 (DPP4) inhibitors. J Med Chem53:5620-8 (2010) 
 
Dipeptidyl peptidase 8
Name:Dipeptidyl peptidase 8
Type:Enzyme
Mol. Mass.:103342.62
Organism:Homo sapiens (Human)
Description:Q6V1X1
Residue:898
BDBM50324496
NameBDBM50324496
Synonyms:6-(aminomethyl)-5-(2,4-dichlorophenyl)-7-methyl-N-(oxazol-2-ylmethyl)imidazo[1,2-a]pyrimidine-2-carboxamide | CHEMBL1215163
TypeSmall organic molecule
Emp. Form.C19H16Cl2N6O2
Mol. Mass.431.275
SMILESCc1nc2nc(cn2c(c1CN)-c1ccc(Cl)cc1Cl)C(=O)NCc1ncco1