Reaction Details
TargetDipeptidyl peptidase 4
LigandBDBM50324497
Substrate/Competitorn/a
Meas. Tech.ChEMBL_649272 (CHEMBL1218970)
Ki 0.6±n/a nM
Citation Meng, WBrigance, RPChao, HJFura, AHarrity, TMarcinkeviciene, JO'Connor, SPTamura, JKXie, DZhang, YKlei, HEKish, KWeigelt, CATurdi, HWang, AZahler, RKirby, MSHamann, LG Discovery of 6-(aminomethyl)-5-(2,4-dichlorophenyl)-7-methylimidazo[1,2-a]pyrimidine-2-carboxamides as potent, selective dipeptidyl peptidase-4 (DPP4) inhibitors. J Med Chem53:5620-8 (2010) 
 
Dipeptidyl peptidase 4
Name:Dipeptidyl peptidase 4
Type:Enzyme
Mol. Mass.:88271.01
Organism:Homo sapiens (Human)
Description:P27487
Residue:766
BDBM50324497
NameBDBM50324497
Synonyms:(6-(aminomethyl)-5-(2,4-dichlorophenyl)-7-methylimidazo[1,2-a]pyrimidin-2-yl)(4,4-dimethyloxazolidin-3-yl)methanone | CHEMBL1215164
TypeSmall organic molecule
Emp. Form.C20H21Cl2N5O2
Mol. Mass.434.319
SMILESCc1nc2nc(cn2c(c1CN)-c1ccc(Cl)cc1Cl)C(=O)N1COCC1(C)C