Reaction Details
TargetDipeptidyl peptidase 4
LigandBDBM50324511
Substrate/Competitorn/a
Meas. Tech.ChEMBL_649272 (CHEMBL1218970)
Ki 1.5±n/a nM
Citation Meng, WBrigance, RPChao, HJFura, AHarrity, TMarcinkeviciene, JO'Connor, SPTamura, JKXie, DZhang, YKlei, HEKish, KWeigelt, CATurdi, HWang, AZahler, RKirby, MSHamann, LG Discovery of 6-(aminomethyl)-5-(2,4-dichlorophenyl)-7-methylimidazo[1,2-a]pyrimidine-2-carboxamides as potent, selective dipeptidyl peptidase-4 (DPP4) inhibitors. J Med Chem53:5620-8 (2010) 
 
Dipeptidyl peptidase 4
Name:Dipeptidyl peptidase 4
Type:Enzyme
Mol. Mass.:88271.01
Organism:Homo sapiens (Human)
Description:P27487
Residue:766
BDBM50324511
NameBDBM50324511
Synonyms:6-(aminomethyl)-5-(2,4-dichlorophenyl)-7-methyl-N-(2-(pyridin-3-yl)ethyl)imidazo[1,2-a]pyrimidine-2-carboxamide | CHEMBL1215375
TypeSmall organic molecule
Emp. Form.C22H20Cl2N6O
Mol. Mass.455.34
SMILESCc1nc2nc(cn2c(c1CN)-c1ccc(Cl)cc1Cl)C(=O)NCCc1cccnc1