Reaction Details
TargetDipeptidyl peptidase 9
LigandBDBM50324523
Substrate/Competitorn/a
Meas. Tech.ChEMBL_649274 (CHEMBL1218972)
Ki 2.2±n/a nM
Citation Meng, WBrigance, RPChao, HJFura, AHarrity, TMarcinkeviciene, JO'Connor, SPTamura, JKXie, DZhang, YKlei, HEKish, KWeigelt, CATurdi, HWang, AZahler, RKirby, MSHamann, LG Discovery of 6-(aminomethyl)-5-(2,4-dichlorophenyl)-7-methylimidazo[1,2-a]pyrimidine-2-carboxamides as potent, selective dipeptidyl peptidase-4 (DPP4) inhibitors. J Med Chem53:5620-8 (2010) 
 
Dipeptidyl peptidase 9
Name:Dipeptidyl peptidase 9
Type:Enzyme
Mol. Mass.:98260.70
Organism:Homo sapiens (Human)
Description:Q86TI2
Residue:863
BDBM50324523
NameBDBM50324523
Synonyms:CHEMBL1215018 | N-((3S)-1-(6-(aminomethyl)-5-(2,4-dichlorophenyl)-7-methylimidazo[1,2-a]pyrimidine-2-carbonyl)pyrrolidin-3-yl)methanesulfonamide
TypeSmall organic molecule
Emp. Form.C20H22Cl2N6O3S
Mol. Mass.497.398
SMILESCc1nc2nc(cn2c(c1CN)-c1ccc(Cl)cc1Cl)C(=O)N1CC[C@@H](C1)NS(C)(=O)=O