Reaction Details
TargetDipeptidyl peptidase 9
LigandBDBM50324525
Substrate/Competitorn/a
Meas. Tech.ChEMBL_649274 (CHEMBL1218972)
Ki 2±n/a nM
Citation Meng, WBrigance, RPChao, HJFura, AHarrity, TMarcinkeviciene, JO'Connor, SPTamura, JKXie, DZhang, YKlei, HEKish, KWeigelt, CATurdi, HWang, AZahler, RKirby, MSHamann, LG Discovery of 6-(aminomethyl)-5-(2,4-dichlorophenyl)-7-methylimidazo[1,2-a]pyrimidine-2-carboxamides as potent, selective dipeptidyl peptidase-4 (DPP4) inhibitors. J Med Chem53:5620-8 (2010) 
 
Dipeptidyl peptidase 9
Name:Dipeptidyl peptidase 9
Type:Enzyme
Mol. Mass.:98260.70
Organism:Homo sapiens (Human)
Description:Q86TI2
Residue:863
BDBM50324525
NameBDBM50324525
Synonyms:6-(aminomethyl)-5-(2,4-dichlorophenyl)-N,7-dimethyl-N-(2-(methylsulfonyl)ethyl)imidazo[1,2-a]pyrimidine-2-carboxamide | CHEMBL1215088
TypeSmall organic molecule
Emp. Form.C19H21Cl2N5O3S
Mol. Mass.470.373
SMILESCN(CCS(C)(=O)=O)C(=O)c1cn2c(c(CN)c(C)nc2n1)-c1ccc(Cl)cc1Cl