Reaction Details
TargetLysine-specific demethylase 4A
LigandBDBM50324527
Substrate/Competitorn/a
Meas. Tech.ChEMBL_649377 (CHEMBL1219075)
IC50 8100±n/a nM
Citation Hamada, SSuzuki, TMino, KKoseki, KOehme, FFlamme, IOzasa, HItoh, YOgasawara, DKomaarashi, HKato, ATsumoto, HNakagawa, HHasegawa, MSasaki, RMizukami, TMiyata, N Design, synthesis, enzyme-inhibitory activity, and effect on human cancer cells of a novel series of jumonji domain-containing protein 2 histone demethylase inhibitors. J Med Chem53:5629-38 (2010) 
 
Lysine-specific demethylase 4A
Name:Lysine-specific demethylase 4A
Type:Enzyme
Mol. Mass.:120647.83
Organism:Homo sapiens (Human)
Description:O75164
Residue:1064
BDBM50324527
NameBDBM50324527
Synonyms:4-[(8-Dimethylaminooctyl)-(hydroxyl)amino]-4-oxobutanoic Acid Hydrochloride | CHEMBL1215587
TypeSmall organic molecule
Emp. Form.C14H28N2O4
Mol. Mass.288.3831
SMILESCN(C)CCCCCCCCN(O)C(=O)CCC(O)=O