Reaction Details
TargetLysine-specific demethylase 4A
LigandBDBM50324530
Substrate/Competitorn/a
Meas. Tech.ChEMBL_649377 (CHEMBL1219075)
IC50 4400±n/a nM
Citation Hamada, SSuzuki, TMino, KKoseki, KOehme, FFlamme, IOzasa, HItoh, YOgasawara, DKomaarashi, HKato, ATsumoto, HNakagawa, HHasegawa, MSasaki, RMizukami, TMiyata, N Design, synthesis, enzyme-inhibitory activity, and effect on human cancer cells of a novel series of jumonji domain-containing protein 2 histone demethylase inhibitors. J Med Chem53:5629-38 (2010) 
 
Lysine-specific demethylase 4A
Name:Lysine-specific demethylase 4A
Type:Enzyme
Mol. Mass.:120647.83
Organism:Homo sapiens (Human)
Description:O75164
Residue:1064
BDBM50324530
NameBDBM50324530
Synonyms:CHEMBL1215590 | tert-Butyl 3-({Hydroxy[9-(methylamino)nonanoyl]}amino)propanoicAcid Hydrochloride
TypeSmall organic molecule
Emp. Form.C13H26N2O4
Mol. Mass.274.3565
SMILESCNCCCCCCCCC(=O)N(O)CCC(O)=O