Reaction Details
TargetLysine-specific demethylase 4C
LigandBDBM26113
Substrate/Competitorn/a
Meas. Tech.ChEMBL_649376 (CHEMBL1219074)
IC50 9400±n/a nM
Citation Hamada, SSuzuki, TMino, KKoseki, KOehme, FFlamme, IOzasa, HItoh, YOgasawara, DKomaarashi, HKato, ATsumoto, HNakagawa, HHasegawa, MSasaki, RMizukami, TMiyata, N Design, synthesis, enzyme-inhibitory activity, and effect on human cancer cells of a novel series of jumonji domain-containing protein 2 histone demethylase inhibitors. J Med Chem53:5629-38 (2010) 
 
Lysine-specific demethylase 4C
Name:Lysine-specific demethylase 4C
Type:Protein
Mol. Mass.:119979.01
Organism:Homo sapiens (Human)
Description:Q9H3R0
Residue:1056
BDBM26113
NameBDBM26113
Synonyms:2,4 PDCA pyridine carboxylate, 6a | pyridine-2,4-dicarboxylic acid
TypeSmall organic molecule
Emp. Form.C7H5NO4
Mol. Mass.167.1189
SMILESOC(=O)c1ccnc(c1)C(O)=O