Reaction Details
TargetLysine-specific demethylase 4C
LigandBDBM26106
Substrate/Competitorn/a
Meas. Tech.ChEMBL_649376 (CHEMBL1219074)
IC50 500000±n/a nM
Citation Hamada, SSuzuki, TMino, KKoseki, KOehme, FFlamme, IOzasa, HItoh, YOgasawara, DKomaarashi, HKato, ATsumoto, HNakagawa, HHasegawa, MSasaki, RMizukami, TMiyata, N Design, synthesis, enzyme-inhibitory activity, and effect on human cancer cells of a novel series of jumonji domain-containing protein 2 histone demethylase inhibitors. J Med Chem53:5629-38 (2010) 
 
Lysine-specific demethylase 4C
Name:Lysine-specific demethylase 4C
Type:Protein
Mol. Mass.:119979.01
Organism:Homo sapiens (Human)
Description:Q9H3R0
Residue:1056
BDBM26106
NameBDBM26106
Synonyms:CHEMBL90852 NOG [(carboxymethyl)carbamoyl]formic acid
TypeSmall organic molecule
Emp. Form.C4H5NO5
Mol. Mass.147.0862
SMILESOC(=O)CNC(=O)C(O)=O