Reaction Details
TargetLysine-specific demethylase 4C
LigandBDBM50324532
Substrate/Competitorn/a
Meas. Tech.ChEMBL_649376 (CHEMBL1219074)
IC50 10000±n/a nM
Citation Hamada, SSuzuki, TMino, KKoseki, KOehme, FFlamme, IOzasa, HItoh, YOgasawara, DKomaarashi, HKato, ATsumoto, HNakagawa, HHasegawa, MSasaki, RMizukami, TMiyata, N Design, synthesis, enzyme-inhibitory activity, and effect on human cancer cells of a novel series of jumonji domain-containing protein 2 histone demethylase inhibitors. J Med Chem53:5629-38 (2010) 
 
Lysine-specific demethylase 4C
Name:Lysine-specific demethylase 4C
Type:Protein
Mol. Mass.:119979.01
Organism:Homo sapiens (Human)
Description:Q9H3R0
Residue:1056
BDBM50324532
NameBDBM50324532
Synonyms:3-{[6-(Dimethylamino)hexanoyl](hydroxy)amino}propanoic Acid Hydrochloride | CHEMBL1215450
TypeSmall organic molecule
Emp. Form.C11H22N2O4
Mol. Mass.246.3034
SMILESCN(C)CCCCCC(=O)N(O)CCC(O)=O