Reaction Details
TargetKynurenine/alpha-aminoadipate aminotransferase, mitochondrial
LigandBDBM50416560
Substrate/Competitorn/a
Meas. Tech.ChEMBL_649389 (CHEMBL1219087)
IC50 1500±n/a nM
Citation Rossi, FValentina, CGaravaglia, SSathyasaikumar, KVSchwarcz, RKojima, SOkuwaki, KOno, SKajii, YRizzi, M Crystal structure-based selective targeting of the pyridoxal 5'-phosphate dependent enzyme kynurenine aminotransferase II for cognitive enhancement. J Med Chem53:5684-9 (2010) 
 
Kynurenine/alpha-aminoadipate aminotransferase, mitochondrial
Name:Kynurenine/alpha-aminoadipate aminotransferase, mitochondrial
Type:Enzyme
Mol. Mass.:47353.09
Organism:Homo sapiens (Human)
Description:Q8N5Z0
Residue:425
BDBM50416560
NameBDBM50416560
Synonyms:CHEMBL1215660
TypeSmall organic molecule
Emp. Form.C17H19FN4O4
Mol. Mass.362.3556
SMILESC[C@@H]1COc2c(N3CCN(N)CC3)c(F)cc3c2n1cc(C(O)=O)c3=O