Reaction Details
TargetRho-associated protein kinase 2
LigandBDBM50324585
Substrate/Competitorn/a
Meas. Tech.ChEMBL_649466 (CHEMBL1219164)
IC50 25±n/a nM
Citation Fang, XYin, YChen, YTYao, LWang, BCameron, MDLin, LKhan, SRuiz, CSchröter, TGrant, WWeiser, APocas, JPachori, ASchürer, SLograsso, PFeng, Y Tetrahydroisoquinoline derivatives as highly selective and potent Rho kinase inhibitors. J Med Chem53:5727-37 (2010) 
 
Rho-associated protein kinase 2
Name:Rho-associated protein kinase 2
Type:Protein
Mol. Mass.:160885.43
Organism:Homo sapiens (Human)
Description:O75116
Residue:1388
BDBM50324585
NameBDBM50324585
Synonyms:CHEMBL1215022 | N-(4-(1H-Pyrazol-4-yl)phenyl)-2-amino-2-(4-chlorophenyl)-acetamide
TypeSmall organic molecule
Emp. Form.C17H15ClN4O
Mol. Mass.326.78
SMILESNC(C(=O)Nc1ccc(cc1)-c1cn[nH]c1)c1ccc(Cl)cc1