Reaction Details
TargetRho-associated protein kinase 2
LigandBDBM50324598
Substrate/Competitorn/a
Meas. Tech.ChEMBL_649463 (CHEMBL1219161)
IC50 15±n/a nM
Citation Fang, XYin, YChen, YTYao, LWang, BCameron, MDLin, LKhan, SRuiz, CSchröter, TGrant, WWeiser, APocas, JPachori, ASchürer, SLograsso, PFeng, Y Tetrahydroisoquinoline derivatives as highly selective and potent Rho kinase inhibitors. J Med Chem53:5727-37 (2010) 
 
Rho-associated protein kinase 2
Name:Rho-associated protein kinase 2
Type:Protein
Mol. Mass.:160885.43
Organism:Homo sapiens (Human)
Description:O75116
Residue:1388
BDBM50324598
NameBDBM50324598
Synonyms:(R)-N-(2-(2-(Dimethylamino)ethylthio)-4-(1H-pyrazol-4-yl)-phenyl)-6-methoxy-1,2,3,4-tetra-hydroisoquinoline-3-carboxamide | CHEMBL1215379
TypeSmall organic molecule
Emp. Form.C24H29N5O2S
Mol. Mass.451.584
SMILESCOc1ccc2CN[C@H](Cc2c1)C(=O)Nc1ccc(cc1SCCN(C)C)-c1cn[nH]c1