Reaction Details
TargetRho-associated protein kinase 2
LigandBDBM50324582
Substrate/Competitorn/a
Meas. Tech.ChEMBL_649466 (CHEMBL1219164)
IC50 18±n/a nM
Citation Fang, XYin, YChen, YTYao, LWang, BCameron, MDLin, LKhan, SRuiz, CSchröter, TGrant, WWeiser, APocas, JPachori, ASchürer, SLograsso, PFeng, Y Tetrahydroisoquinoline derivatives as highly selective and potent Rho kinase inhibitors. J Med Chem53:5727-37 (2010) 
 
Rho-associated protein kinase 2
Name:Rho-associated protein kinase 2
Type:Protein
Mol. Mass.:160885.43
Organism:Homo sapiens (Human)
Description:O75116
Residue:1388
BDBM50324582
NameBDBM50324582
Synonyms:(R)-2-(Cyclopropylmethyl)-N-(2-(2-(dimethylamino)ethoxy)-5-fluoro-4-(1H-pyrazol-4-yl)phenyl)-1,2,3,4-tetrahydroisoquinoline-3-carboxamide | CHEMBL1215527
TypeSmall organic molecule
Emp. Form.C27H32FN5O2
Mol. Mass.477.5737
SMILESCN(C)CCOc1cc(-c2cn[nH]c2)c(F)cc1NC(=O)[C@H]1Cc2ccccc2CN1CC1CC1