Reaction Details
TargetRho-associated protein kinase 2
LigandBDBM50324583
Substrate/Competitorn/a
Meas. Tech.ChEMBL_649466 (CHEMBL1219164)
IC50 250±n/a nM
Citation Fang, XYin, YChen, YTYao, LWang, BCameron, MDLin, LKhan, SRuiz, CSchröter, TGrant, WWeiser, APocas, JPachori, ASchürer, SLograsso, PFeng, Y Tetrahydroisoquinoline derivatives as highly selective and potent Rho kinase inhibitors. J Med Chem53:5727-37 (2010) 
 
Rho-associated protein kinase 2
Name:Rho-associated protein kinase 2
Type:Protein
Mol. Mass.:160885.43
Organism:Homo sapiens (Human)
Description:O75116
Residue:1388
BDBM50324583
NameBDBM50324583
Synonyms:(R)-N-(2-(2-(Dimethylamino)ethoxy)-3-fluoro-4-(1H-pyrazol-4-yl)phenyl)-6-methoxy-1,2,3,4-tetrahydroisoquinoline-3-carboxamide | CHEMBL1215453
TypeSmall organic molecule
Emp. Form.C24H28FN5O3
Mol. Mass.453.5092
SMILESCOc1ccc2CN[C@H](Cc2c1)C(=O)Nc1ccc(-c2cn[nH]c2)c(F)c1OCCN(C)C