Reaction Details
TargetRho-associated protein kinase 2
LigandBDBM50324579
Substrate/Competitorn/a
Meas. Tech.ChEMBL_649463 (CHEMBL1219161)
IC50 9±n/a nM
Citation Fang, XYin, YChen, YTYao, LWang, BCameron, MDLin, LKhan, SRuiz, CSchröter, TGrant, WWeiser, APocas, JPachori, ASchürer, SLograsso, PFeng, Y Tetrahydroisoquinoline derivatives as highly selective and potent Rho kinase inhibitors. J Med Chem53:5727-37 (2010) 
 
Rho-associated protein kinase 2
Name:Rho-associated protein kinase 2
Type:Protein
Mol. Mass.:160885.43
Organism:Homo sapiens (Human)
Description:O75116
Residue:1388
BDBM50324579
NameBDBM50324579
Synonyms:(R)-N-(2-(2-(dimethylamino)ethoxy)-4-(1H-pyrazol-4-yl)phenyl)-2-ethyl-6-methoxy-1,2,3,4-tetrahydroisoquinoline-3-carboxamide | CHEMBL1215594
TypeSmall organic molecule
Emp. Form.C26H32FN5O3
Mol. Mass.481.5624
SMILESCCN1Cc2ccc(OC)cc2C[C@@H]1C(=O)Nc1cc(F)c(cc1OCCN(C)C)-c1cn[nH]c1