Reaction Details
TargetRho-associated protein kinase 2
LigandBDBM50324574
Substrate/Competitorn/a
Meas. Tech.ChEMBL_649466 (CHEMBL1219164)
IC50 51±n/a nM
Citation Fang, XYin, YChen, YTYao, LWang, BCameron, MDLin, LKhan, SRuiz, CSchröter, TGrant, WWeiser, APocas, JPachori, ASchürer, SLograsso, PFeng, Y Tetrahydroisoquinoline derivatives as highly selective and potent Rho kinase inhibitors. J Med Chem53:5727-37 (2010) 
 
Rho-associated protein kinase 2
Name:Rho-associated protein kinase 2
Type:Protein
Mol. Mass.:160885.43
Organism:Homo sapiens (Human)
Description:O75116
Residue:1388
BDBM50324574
NameBDBM50324574
Synonyms:(R)-6-Methoxy-N-(2-((1-methylpiperidin-4-yl)methoxy)-4-(1Hpyrazol-4-yl)phenyl)-1,2,3,4-tetrahydroisoquinoline-3-carboxamide | CHEMBL1215304
TypeSmall organic molecule
Emp. Form.C27H33N5O3
Mol. Mass.475.5826
SMILESCOc1ccc2CN[C@H](Cc2c1)C(=O)Nc1ccc(cc1OCC1CCN(C)CC1)-c1cn[nH]c1