Reaction Details
TargetSerine/threonine-protein kinase MRCK alpha
LigandBDBM50324574
Substrate/Competitorn/a
Meas. Tech.ChEMBL_649558 (CHEMBL1219256)
IC50 669±n/a nM
Citation Fang, XYin, YChen, YTYao, LWang, BCameron, MDLin, LKhan, SRuiz, CSchröter, TGrant, WWeiser, APocas, JPachori, ASchürer, SLograsso, PFeng, Y Tetrahydroisoquinoline derivatives as highly selective and potent Rho kinase inhibitors. J Med Chem53:5727-37 (2010) 
 
Serine/threonine-protein kinase MRCK alpha
Name:Serine/threonine-protein kinase MRCK alpha
Type:Protien
Mol. Mass.:197305.74
Organism:Homo sapiens (Human)
Description:Q5VT25
Residue:1732
BDBM50324574
NameBDBM50324574
Synonyms:(R)-6-Methoxy-N-(2-((1-methylpiperidin-4-yl)methoxy)-4-(1Hpyrazol-4-yl)phenyl)-1,2,3,4-tetrahydroisoquinoline-3-carboxamide | CHEMBL1215304
TypeSmall organic molecule
Emp. Form.C27H33N5O3
Mol. Mass.475.5826
SMILESCOc1ccc2CN[C@H](Cc2c1)C(=O)Nc1ccc(cc1OCC1CCN(C)CC1)-c1cn[nH]c1