Reaction Details
TargetSerine/threonine-protein kinase MRCK alpha
LigandBDBM50324578
Substrate/Competitorn/a
Meas. Tech.ChEMBL_649558 (CHEMBL1219256)
IC50 333±n/a nM
Citation Fang, XYin, YChen, YTYao, LWang, BCameron, MDLin, LKhan, SRuiz, CSchröter, TGrant, WWeiser, APocas, JPachori, ASchürer, SLograsso, PFeng, Y Tetrahydroisoquinoline derivatives as highly selective and potent Rho kinase inhibitors. J Med Chem53:5727-37 (2010) 
 
Serine/threonine-protein kinase MRCK alpha
Name:Serine/threonine-protein kinase MRCK alpha
Type:Protien
Mol. Mass.:197305.74
Organism:Homo sapiens (Human)
Description:Q5VT25
Residue:1732
BDBM50324578
NameBDBM50324578
Synonyms:(R)-N-(2-(2-(Dimethylamino)ethoxy)-5-fluoro-4-(1H-pyrazol-4-yl)phenyl)-1,2,3,4-tetrahydroiso-quinoline-3-carboxamide | CHEMBL1215524
TypeSmall organic molecule
Emp. Form.C23H26FN5O2
Mol. Mass.423.4832
SMILESCN(C)CCOc1cc(-c2cn[nH]c2)c(F)cc1NC(=O)[C@H]1Cc2ccccc2CN1