Reaction Details
TargetTyrosine-protein kinase Fyn
LigandBDBM4567
Substrate/Competitorn/a
Meas. Tech.ChEMBL_653001 (CHEMBL1226204)
IC50>300000±n/a nM
Citation Blair, JARauh, DKung, CYun, CHFan, QWRode, HZhang, CEck, MJWeiss, WAShokat, KM Structure-guided development of affinity probes for tyrosine kinases using chemical genetics. Nat Chem Biol3:229-38 (2007) 
 
Tyrosine-protein kinase Fyn
Name:Tyrosine-protein kinase Fyn
Type:Enzyme
Mol. Mass.:60762.21
Organism:Homo sapiens (Human)
Description:P06241
Residue:537
BDBM4567
NameBDBM4567
Synonyms:4-anilinoquinazoline deriv. 2 CHEMBL285063 US9422297, PD168393
TypeSmall organic molecule
Emp. Form.C17H13BrN4O
Mol. Mass.369.215
SMILESBrc1cccc(Nc2ncnc3ccc(NC(=O)C=C)cc23)c1