Reaction Details
TargetCoagulation factor XI
LigandBDBM50324744
Substrate/Competitorn/a
Meas. Tech.ChEMBL_651390 (CHEMBL1227363)
Ki>33000±n/a nM
Citation Anselm, LBanner, DWBenz, JZbinden, KGHimber, JHilpert, HHuber, WKuhn, BMary, JLOtteneder, MBPanday, NRicklin, FStahl, MThomi, SHaap, W Discovery of a factor Xa inhibitor (3R,4R)-1-(2,2-difluoro-ethyl)-pyrrolidine-3,4-dicarboxylic acid 3-[(5-chloro-pyridin-2-yl)-amide] 4-[[2-fluoro-4-(2-oxo-2H-pyridin-1-yl)-phenyl]-amide] as a clinical candidate. Bioorg Med Chem Lett20:5313-9 (2010) 
 
Coagulation factor XI
Name:Coagulation factor XI
Type:Enzyme
Mol. Mass.:70130.58
Organism:Homo sapiens (Human)
Description:P03951
Residue:625
BDBM50324744
NameBDBM50324744
Synonyms:(3R,4R)-N3-(5-chloropyridin-2-yl)-N4-(2-fluoro-4-(2-oxopyridin-1(2H)-yl)phenyl)-1-isopropylpyrrolidine-3,4-dicarboxamide | CHEMBL1221915
TypeSmall organic molecule
Emp. Form.C25H25ClFN5O3
Mol. Mass.497.949
SMILESCC(C)N1C[C@@H]([C@H](C1)C(=O)Nc1ccc(cc1F)-n1ccccc1=O)C(=O)Nc1ccc(Cl)cn1