Reaction Details
TargetProthrombin
LigandBDBM50324747
Substrate/Competitorn/a
Meas. Tech.ChEMBL_651370 (CHEMBL1227190)
Ki>25000±n/a nM
Citation Anselm, LBanner, DWBenz, JZbinden, KGHimber, JHilpert, HHuber, WKuhn, BMary, JLOtteneder, MBPanday, NRicklin, FStahl, MThomi, SHaap, W Discovery of a factor Xa inhibitor (3R,4R)-1-(2,2-difluoro-ethyl)-pyrrolidine-3,4-dicarboxylic acid 3-[(5-chloro-pyridin-2-yl)-amide] 4-[[2-fluoro-4-(2-oxo-2H-pyridin-1-yl)-phenyl]-amide] as a clinical candidate. Bioorg Med Chem Lett20:5313-9 (2010) 
 
Prothrombin
Name:Prothrombin
Type:Protein
Mol. Mass.:70029.57
Organism:Homo sapiens (Human)
Description:P00734
Residue:622
BDBM50324747
NameBDBM50324747
Synonyms:(3R,4R)-N3-(4-chlorophenyl)-N4-(2-fluoro-4-(2-oxopyridin-1(2H)-yl)phenyl)pyrrolidine-3,4-dicarboxamide | CHEMBL1221535
TypeSmall organic molecule
Emp. Form.C23H20ClFN4O3
Mol. Mass.454.881
SMILESFc1cc(ccc1NC(=O)[C@H]1CNC[C@@H]1C(=O)Nc1ccc(Cl)cc1)-n1ccccc1=O