Reaction Details
TargetCoagulation factor VII/Tissue factor
LigandBDBM50324743
Substrate/Competitorn/a
Meas. Tech.ChEMBL_651369 (CHEMBL1227189)
Ki>33000±n/a nM
Citation Anselm, LBanner, DWBenz, JZbinden, KGHimber, JHilpert, HHuber, WKuhn, BMary, JLOtteneder, MBPanday, NRicklin, FStahl, MThomi, SHaap, W Discovery of a factor Xa inhibitor (3R,4R)-1-(2,2-difluoro-ethyl)-pyrrolidine-3,4-dicarboxylic acid 3-[(5-chloro-pyridin-2-yl)-amide] 4-[[2-fluoro-4-(2-oxo-2H-pyridin-1-yl)-phenyl]-amide] as a clinical candidate. Bioorg Med Chem Lett20:5313-9 (2010) 
 
Coagulation factor VII/Tissue factor
Name:Coagulation factor VII/Tissue factor
Type:n/a
Mol. Mass.:n/a
Description:ASSAY_ID of EBI is 69535
Components:This complex has 2 components.
Component 1
Name:Tissue factor
Synonyms:CD_antigen=CD142 Coagulation factor VII/tissue factor TF Thromboplastin | Tissue factor
Type:PROTEIN
Mol. Mass.:33067.61
Organism:Homo sapiens (Human)
Description:ChEMBL_936735
Residue:295
Component 2
Name:Coagulation factor VII
Synonyms:Eptacog alfa FA7_HUMAN Factor VIIa (fVIIa) SPCA serum prothrombin conversion accelerator
Type:Enzyme
Mol. Mass.:51599.89
Organism:Homo sapiens (Human)
Description:n/a
Residue:466
BDBM50324743
NameBDBM50324743
Synonyms:(3R,4R)-1-(2,2-DIFLUORO-ETHYL)-PYRROLIDINE-3,4-DICARBOXYLIC ACID 3-[(5-CHLORO-PYRIDIN-2-YL)-AMIDE]-4-{[2-FLUORO-4-(2-OXO-2H-PYRIDIN-1-YL)-PHENYL]-AMIDE} CHEMBL1221913
TypeSmall organic molecule
Emp. Form.C24H21ClF3N5O3
Mol. Mass.519.903
SMILESFC(F)CN1C[C@@H]([C@H](C1)C(=O)Nc1ccc(cc1F)-n1ccccc1=O)C(=O)Nc1ccc(Cl)cn1