Reaction Details
TargetCoagulation factor X
LigandBDBM50324751
Substrate/Competitorn/a
Meas. Tech.ChEMBL_651359 (CHEMBL1227179)
Ki 22±n/a nM
Citation Anselm, LBanner, DWBenz, JZbinden, KGHimber, JHilpert, HHuber, WKuhn, BMary, JLOtteneder, MBPanday, NRicklin, FStahl, MThomi, SHaap, W Discovery of a factor Xa inhibitor (3R,4R)-1-(2,2-difluoro-ethyl)-pyrrolidine-3,4-dicarboxylic acid 3-[(5-chloro-pyridin-2-yl)-amide] 4-[[2-fluoro-4-(2-oxo-2H-pyridin-1-yl)-phenyl]-amide] as a clinical candidate. Bioorg Med Chem Lett20:5313-9 (2010) 
 
Coagulation factor X
Name:Coagulation factor X
Type:Enzyme
Mol. Mass.:54726.60
Organism:Homo sapiens (Human)
Description:n/a
Residue:488
BDBM50324751
NameBDBM50324751
Synonyms:(3R,4R)-methyl 3-(4-chlorophenylcarbamoyl)-4-(2-fluoro-4-(2-oxopyridin-1(2H)-yl)phenylcarbamoyl)pyrrolidine-1-carboxylate | CHEMBL1221580
TypeSmall organic molecule
Emp. Form.C25H22ClFN4O5
Mol. Mass.512.917
SMILESCOC(=O)N1C[C@@H]([C@H](C1)C(=O)Nc1ccc(cc1F)-n1ccccc1=O)C(=O)Nc1ccc(Cl)cc1