Reaction Details
TargetCoagulation factor X
LigandBDBM50324774
Substrate/Competitorn/a
Meas. Tech.ChEMBL_651359 (CHEMBL1227179)
Ki 810±n/a nM
Citation Anselm, LBanner, DWBenz, JZbinden, KGHimber, JHilpert, HHuber, WKuhn, BMary, JLOtteneder, MBPanday, NRicklin, FStahl, MThomi, SHaap, W Discovery of a factor Xa inhibitor (3R,4R)-1-(2,2-difluoro-ethyl)-pyrrolidine-3,4-dicarboxylic acid 3-[(5-chloro-pyridin-2-yl)-amide] 4-[[2-fluoro-4-(2-oxo-2H-pyridin-1-yl)-phenyl]-amide] as a clinical candidate. Bioorg Med Chem Lett20:5313-9 (2010) 
 
Coagulation factor X
Name:Coagulation factor X
Type:Enzyme
Mol. Mass.:54726.60
Organism:Homo sapiens (Human)
Description:n/a
Residue:488
BDBM50324774
NameBDBM50324774
Synonyms:(3R,4R)-N3-(3-chloro-4-methoxyphenyl)-N4-(2-fluoro-4-(2-oxopyridin-1(2H)-yl)phenyl)-1-(methylsulfonyl)pyrrolidine-3,4-dicarboxamide | CHEMBL1222018
TypeSmall organic molecule
Emp. Form.C25H24ClFN4O6S
Mol. Mass.562.998
SMILESCOc1ccc(NC(=O)[C@H]2CN(C[C@@H]2C(=O)Nc2ccc(cc2F)-n2ccccc2=O)S(C)(=O)=O)cc1Cl