Reaction Details
TargetCoagulation factor X
LigandBDBM50324775
Substrate/Competitorn/a
Meas. Tech.ChEMBL_651359 (CHEMBL1227179)
Ki 192±n/a nM
Citation Anselm, LBanner, DWBenz, JZbinden, KGHimber, JHilpert, HHuber, WKuhn, BMary, JLOtteneder, MBPanday, NRicklin, FStahl, MThomi, SHaap, W Discovery of a factor Xa inhibitor (3R,4R)-1-(2,2-difluoro-ethyl)-pyrrolidine-3,4-dicarboxylic acid 3-[(5-chloro-pyridin-2-yl)-amide] 4-[[2-fluoro-4-(2-oxo-2H-pyridin-1-yl)-phenyl]-amide] as a clinical candidate. Bioorg Med Chem Lett20:5313-9 (2010) 
 
Coagulation factor X
Name:Coagulation factor X
Type:Enzyme
Mol. Mass.:54726.60
Organism:Homo sapiens (Human)
Description:n/a
Residue:488
BDBM50324775
NameBDBM50324775
Synonyms:(3R,4R)-1-METHANESULFONYL-PYRROLIDINE-3,4--DICARBOXYLIC ACID 3-[(3-FLUORO-4-METHOXY-PHENYL)-AMIDE] 4-{[2-FLUORO-4-(2-OXO-2H-PYRIDIN-1-YL)-PHENYL]-AMIDE} CHEMBL1222019
TypeSmall organic molecule
Emp. Form.C25H24F2N4O6S
Mol. Mass.546.543
SMILESCOc1ccc(NC(=O)[C@H]2CN(C[C@@H]2C(=O)Nc2ccc(cc2F)-n2ccccc2=O)S(C)(=O)=O)cc1F