Reaction Details
TargetCoagulation factor X
LigandBDBM50324780
Substrate/Competitorn/a
Meas. Tech.ChEMBL_651359 (CHEMBL1227179)
Ki 1247±n/a nM
Citation Anselm, LBanner, DWBenz, JZbinden, KGHimber, JHilpert, HHuber, WKuhn, BMary, JLOtteneder, MBPanday, NRicklin, FStahl, MThomi, SHaap, W Discovery of a factor Xa inhibitor (3R,4R)-1-(2,2-difluoro-ethyl)-pyrrolidine-3,4-dicarboxylic acid 3-[(5-chloro-pyridin-2-yl)-amide] 4-[[2-fluoro-4-(2-oxo-2H-pyridin-1-yl)-phenyl]-amide] as a clinical candidate. Bioorg Med Chem Lett20:5313-9 (2010) 
 
Coagulation factor X
Name:Coagulation factor X
Type:Enzyme
Mol. Mass.:54726.60
Organism:Homo sapiens (Human)
Description:n/a
Residue:488
BDBM50324780
NameBDBM50324780
Synonyms:(3R,4R)-N3-(2-fluoro-4-(2-oxopyridin-1(2H)-yl)phenyl)-N4-(1H-indazol-5-yl)-1-(methylsulfonyl)pyrrolidine-3,4-dicarboxamide | CHEMBL1222222
TypeSmall organic molecule
Emp. Form.C25H23FN6O5S
Mol. Mass.538.551
SMILESCS(=O)(=O)N1C[C@@H]([C@H](C1)C(=O)Nc1ccc(cc1F)-n1ccccc1=O)C(=O)Nc1ccc2[nH]ncc2c1