Reaction Details
TargetCoagulation factor X
LigandBDBM50324783
Substrate/Competitorn/a
Meas. Tech.ChEMBL_651359 (CHEMBL1227179)
Ki 92±n/a nM
Citation Anselm, LBanner, DWBenz, JZbinden, KGHimber, JHilpert, HHuber, WKuhn, BMary, JLOtteneder, MBPanday, NRicklin, FStahl, MThomi, SHaap, W Discovery of a factor Xa inhibitor (3R,4R)-1-(2,2-difluoro-ethyl)-pyrrolidine-3,4-dicarboxylic acid 3-[(5-chloro-pyridin-2-yl)-amide] 4-[[2-fluoro-4-(2-oxo-2H-pyridin-1-yl)-phenyl]-amide] as a clinical candidate. Bioorg Med Chem Lett20:5313-9 (2010) 
 
Coagulation factor X
Name:Coagulation factor X
Type:Enzyme
Mol. Mass.:54726.60
Organism:Homo sapiens (Human)
Description:n/a
Residue:488
BDBM50324783
NameBDBM50324783
Synonyms:(3R,4R)-N3-(4-chlorophenyl)-N4-(4-(2,5-dihydro-1H-pyrrole-1-carbonyl)phenyl)-1-(methylsulfonyl)pyrrolidine-3,4-dicarboxamide | CHEMBL1222225
TypeSmall organic molecule
Emp. Form.C24H25ClN4O5S
Mol. Mass.516.997
SMILESCS(=O)(=O)N1C[C@@H]([C@H](C1)C(=O)Nc1ccc(cc1)C(=O)N1CC=CC1)C(=O)Nc1ccc(Cl)cc1