Reaction Details
TargetTyrosine-protein kinase Yes
LigandBDBM50324796
Substrate/Competitorn/a
Meas. Tech.ChEMBL_651414 (CHEMBL1227387)
IC50 38100±n/a nM
Citation Giraud, FMarchand, PCarbonnelle, DSartor, MLang, FDuflos, M Synthesis of N-aryl-3-(indol-3-yl)propanamides and their immunosuppressive activities. Bioorg Med Chem Lett20:5203-6 (2010) 
 
Tyrosine-protein kinase Yes
Name:Tyrosine-protein kinase Yes
Type:Protein
Mol. Mass.:60801.54
Organism:Homo sapiens (Human)
Description:P07947
Residue:543
BDBM50324796
NameBDBM50324796
Synonyms:3-[1-(4-chlorobenzyl)-1H-indol-3-yl]-N-(4-nitrophenyl)propanamide | CHEMBL1221633
TypeSmall organic molecule
Emp. Form.C24H20ClN3O3
Mol. Mass.433.887
SMILES[O-][N+](=O)c1ccc(NC(=O)CCc2cn(Cc3ccc(Cl)cc3)c3ccccc23)cc1