Reaction Details
Target5-hydroxytryptamine receptor 2C
LigandBDBM50324863
Substrate/Competitorn/a
Meas. Tech.ChEMBL_651484 (CHEMBL1227601)
IC50 7±n/a nM
Citation Park, CMKim, SYPark, WKChoi, JHSeong, CM Synthesis and SAR of (piperazin-1-yl-phenyl)-arylsulfonamides: a novel series of atypical antipsychotic agents. Bioorg Med Chem Lett20:5221-4 (2010) 
 
5-hydroxytryptamine receptor 2C
Name:5-hydroxytryptamine receptor 2C
Type:G Protein-Coupled Receptor (GPCR)
Mol. Mass.:51836.79
Organism:Homo sapiens (Human)
Description:P28335
Residue:458
BDBM50324863
NameBDBM50324863
Synonyms:CHEMBL1222363 | Naphthalene-2-sulfonic acid [3-(4-methyl-piperazin-1-yl)-phenyl]-propyl-amide
TypeSmall organic molecule
Emp. Form.C24H29N3O2S
Mol. Mass.423.571
SMILESCCCN(c1cccc(c1)N1CCN(C)CC1)S(=O)(=O)c1ccc2ccccc2c1