Reaction Details
TargetDisintegrin and metalloproteinase domain-containing protein 17
LigandBDBM50324998
Substrate/Competitorn/a
Meas. Tech.ChEMBL_651587 (CHEMBL1227970)
Ki 0.5±n/a nM
Citation Yu, WTong, LKim, SHWong, MKChen, LYang, DYShankar, BBLavey, BJZhou, GKosinski, ARizvi, RLi, DFeltz, RJPiwinski, JJRosner, KEShih, NYSiddiqui, MAGuo, ZOrth, PShah, HSun, JUmland, SLundell, DJNiu, XKozlowski, JA Biaryl substituted hydantoin compounds as TACE inhibitors. Bioorg Med Chem Lett20:5286-9 (2010) 
 
Disintegrin and metalloproteinase domain-containing protein 17
Name:Disintegrin and metalloproteinase domain-containing protein 17
Type:Enzyme
Mol. Mass.:93007.89
Organism:Homo sapiens (Human)
Description:
Residue:824
BDBM50324998
NameBDBM50324998
Synonyms:(R)-5-((6-methoxy-1-oxoisoindolin-2-yl)methyl)-5-(4-(pyridin-2-yl)phenyl)imidazolidine-2,4-dione | CHEMBL1222866
TypeSmall organic molecule
Emp. Form.C24H20N4O4
Mol. Mass.428.44
SMILESCOc1ccc2CN(C[C@]3(NC(=O)NC3=O)c3ccc(cc3)-c3ccccn3)C(=O)c2c1